{"text_format":"1","workbook":"xlsx","n_sheets":3,"sheets":["所得税","明細書原本","給与計算"],"not_rendered":{"charts":0,"images":0,"macros":1,"external_links":0,"defined_names":2,"comments":0,"pivot_tables":0},"unopened":[],"bounds":{"document_bytes":16777216,"sheet_cells":100000,"rows_first":2000,"rows_last":500,"rows_between":2000,"halvings":0,"cell_chars":16384,"cell_head_chars":4096},"cells_cut":0,"cells_raw":0,"read":"whole","date_system":"1900"}

{"sheet":"所得税","index":0,"n_rows":443,"n_cols":12,"rows_kept":443,"cut":false,"hidden":false,"merged":[[0,1,0,11],[1,1,1,11],[411,1,411,2],[414,11,434,11],[435,11,447,11]]}
[null,"給与所得の源泉徴収税額表（平成26年分）"]
[null,"月　額　表（平成24年３月31日財務省告示第115号別表第一）"]
[null,"   その月の社会保",null,"甲",null,null,null,null,null,null,null,"　"]
[null,"   険料等控除後の",null,"扶        養        親        族        等        の        数",null,null,null,null,null,null,null,"乙"]
[null,"   給与等の金額",null,"0  人","1  人","2  人","3  人","4  人","5  人","6  人","7  人"]
[null,"以  上","未  満","税                                            額",null,null,null,null,null,null,null,"税  額"]
[null,"円","円","円","円","円","円","円","円","円","円","円"]
[null,88000,"円未満",0,0,0,0,0,0,0,0,"その月の社会保険料等控除後の給与等の金額の3.063％に相当する金額"]
[]
[1,88000,89000,130,0,0,0,0,0,0,0,3200]
[2,89000,90000,180,0,0,0,0,0,0,0,3200]
[3,90000,91000,230,0,0,0,0,0,0,0,3200]
[4,91000,92000,290,0,0,0,0,0,0,0,3200]
[5,92000,93000,340,0,0,0,0,0,0,0,3300]
[]
[6,93000,94000,390,0,0,0,0,0,0,0,3300]
[7,94000,95000,440,0,0,0,0,0,0,0,3300]
[8,95000,96000,490,0,0,0,0,0,0,0,3400]
[9,96000,97000,540,0,0,0,0,0,0,0,3400]
[10,97000,98000,590,0,0,0,0,0,0,0,3500]
[]
[11,98000,99000,640,0,0,0,0,0,0,0,3500]
[12,99000,101000,720,0,0,0,0,0,0,0,3600]
[13,101000,103000,830,0,0,0,0,0,0,0,3600]
[14,103000,105000,930,0,0,0,0,0,0,0,3700]
[15,105000,107000,1030,0,0,0,0,0,0,0,3800]
[]
[16,107000,109000,1130,0,0,0,0,0,0,0,3800]
[17,109000,111000,1240,0,0,0,0,0,0,0,3900]
[18,111000,113000,1340,0,0,0,0,0,0,0,4000]
[19,113000,115000,1440,0,0,0,0,0,0,0,4100]
[20,115000,117000,1540,0,0,0,0,0,0,0,4100]
[]
[21,117000,119000,1640,0,0,0,0,0,0,0,4200]
[22,119000,121000,1750,120,0,0,0,0,0,0,4300]
[23,121000,123000,1850,220,0,0,0,0,0,0,4500]
[24,123000,125000,1950,330,0,0,0,0,0,0,4800]
[25,125000,127000,2050,430,0,0,0,0,0,0,5100]
[]
[26,127000,129000,2150,530,0,0,0,0,0,0,5400]
[27,129000,131000,2260,630,0,0,0,0,0,0,5700]
[28,131000,133000,2360,740,0,0,0,0,0,0,6000]
[29,133000,135000,2460,840,0,0,0,0,0,0,6300]
[30,135000,137000,2550,930,0,0,0,0,0,0,6600]
[]
[31,137000,139000,2610,990,0,0,0,0,0,0,6800]
[32,139000,141000,2680,1050,0,0,0,0,0,0,7100]
[33,141000,143000,2740,1110,0,0,0,0,0,0,7500]
[34,143000,145000,2800,1170,0,0,0,0,0,0,7800]
[35,145000,147000,2860,1240,0,0,0,0,0,0,8100]
[]
[36,147000,149000,2920,1300,0,0,0,0,0,0,8400]
[37,149000,151000,2980,1360,0,0,0,0,0,0,8700]
[38,151000,153000,3050,1430,0,0,0,0,0,0,9000]
[39,153000,155000,3120,1500,0,0,0,0,0,0,9300]
[40,155000,157000,3200,1570,0,0,0,0,0,0,9600]
[]
[41,157000,159000,3270,1640,0,0,0,0,0,0,9900]
[42,159000,161000,3340,1720,100,0,0,0,0,0,10200]
[43,161000,163000,3410,1790,170,0,0,0,0,0,10500]
[44,163000,165000,3480,1860,250,0,0,0,0,0,10800]
[45,165000,167000,3550,1930,320,0,0,0,0,0,11100]
[]
[46,167000,169000,3620,2000,390,0,0,0,0,0,11400]
[47,169000,171000,3700,2070,460,0,0,0,0,0,11700]
[48,171000,173000,3770,2140,530,0,0,0,0,0,12000]
[49,173000,175000,3840,2220,600,0,0,0,0,0,12400]
[50,175000,177000,3910,2290,670,0,0,0,0,0,12700]
[]
[51,177000,179000,3980,2360,750,0,0,0,0,0,13200]
[52,179000,181000,4050,2430,820,0,0,0,0,0,13900]
[53,181000,183000,4120,2500,890,0,0,0,0,0,14600]
[54,183000,185000,4200,2570,960,0,0,0,0,0,15300]
[55,185000,187000,4270,2640,1030,0,0,0,0,0,16000]
[]
[56,187000,189000,4340,2720,1100,0,0,0,0,0,16700]
[57,189000,191000,4410,2790,1170,0,0,0,0,0,17500]
[58,191000,193000,4480,2860,1250,0,0,0,0,0,18100]
[59,193000,195000,4550,2930,1320,0,0,0,0,0,18800]
[60,195000,197000,4630,3000,1390,0,0,0,0,0,19500]
[]
[61,197000,199000,4700,3070,1460,0,0,0,0,0,20200]
[62,199000,201000,4770,3140,1530,0,0,0,0,0,20900]
[63,201000,203000,4840,3220,1600,0,0,0,0,0,21500]
[64,203000,205000,4910,3290,1670,0,0,0,0,0,22200]
[65,205000,207000,4980,3360,1750,130,0,0,0,0,22700]
[]
[66,207000,209000,5050,3430,1820,200,0,0,0,0,23300]
[67,209000,211000,5130,3500,1890,280,0,0,0,0,23900]
[68,211000,213000,5200,3570,1960,350,0,0,0,0,24400]
[69,213000,215000,5270,3640,2030,420,0,0,0,0,25000]
[70,215000,217000,5340,3720,2100,490,0,0,0,0,25500]
[]
[71,217000,219000,5410,3790,2170,560,0,0,0,0,26100]
[72,219000,221000,5480,3860,2250,630,0,0,0,0,26800]
[73,221000,224000,5560,3950,2340,710,0,0,0,0,27400]
[74,224000,227000,5680,4060,2440,830,0,0,0,0,28400]
[75,227000,230000,5780,4170,2550,930,0,0,0,0,29300]
[]
[76,230000,233000,5890,4280,2650,1040,0,0,0,0,30300]
[77,233000,236000,5990,4380,2770,1140,0,0,0,0,31300]
[78,236000,239000,6110,4490,2870,1260,0,0,0,0,32400]
[79,239000,242000,6210,4590,2980,1360,0,0,0,0,33400]
[80,242000,245000,6320,4710,3080,1470,0,0,0,0,34400]
[]
[81,245000,248000,6420,4810,3200,1570,0,0,0,0,35400]
[82,248000,251000,6530,4920,3300,1680,0,0,0,0,36400]
[83,251000,254000,6640,5020,3410,1790,170,0,0,0,37500]
[84,254000,257000,6750,5140,3510,1900,290,0,0,0,38500]
[85,257000,260000,6850,5240,3620,2000,390,0,0,0,39400]
[]
[86,260000,263000,6960,5350,3730,2110,500,0,0,0,40400]
[87,263000,266000,7070,5450,3840,2220,600,0,0,0,41500]
[88,266000,269000,7180,5560,3940,2330,710,0,0,0,42500]
[89,269000,272000,7280,5670,4050,2430,820,0,0,0,43500]
[90,272000,275000,7390,5780,4160,2540,930,0,0,0,44500]
[]
[91,275000,278000,7490,5880,4270,2640,1030,0,0,0,45500]
[92,278000,281000,7610,5990,4370,2760,1140,0,0,0,46600]
[93,281000,284000,7710,6100,4480,2860,1250,0,0,0,47600]
[94,284000,287000,7820,6210,4580,2970,1360,0,0,0,48600]
[95,287000,290000,7920,6310,4700,3070,1460,0,0,0,49500]
[]
[96,290000,293000,8040,6420,4800,3190,1570,0,0,0,50500]
[97,293000,296000,8140,6520,4910,3290,1670,0,0,0,51600]
[98,296000,299000,8250,6640,5010,3400,1790,160,0,0,52300]
[99,299000,302000,8420,6740,5130,3510,1890,280,0,0,52900]
[100,302000,305000,8670,6860,5250,3630,2010,400,0,0,53500]
[]
[101,305000,308000,8910,6980,5370,3760,2130,520,0,0,54200]
[102,308000,311000,9160,7110,5490,3880,2260,640,0,0,54800]
[103,311000,314000,9400,7230,5620,4000,2380,770,0,0,55400]
[104,314000,317000,9650,7350,5740,4120,2500,890,0,0,56100]
[105,317000,320000,9890,7470,5860,4250,2620,1010,0,0,56800]
[]
[106,320000,323000,10140,7600,5980,4370,2750,1130,0,0,57700]
[107,323000,326000,10380,7720,6110,4490,2870,1260,0,0,58500]
[108,326000,329000,10630,7840,6230,4610,2990,1380,0,0,59300]
[109,329000,332000,10870,7960,6350,4740,3110,1500,0,0,60200]
[110,332000,335000,11120,8090,6470,4860,3240,1620,0,0,61100]
[]
[111,335000,338000,11360,8210,6600,4980,3360,1750,130,0,62000]
[112,338000,341000,11610,8370,6720,5110,3480,1870,260,0,62900]
[113,341000,344000,11850,8620,6840,5230,3600,1990,380,0,63800]
[114,344000,347000,12100,8860,6960,5350,3730,2110,500,0,64700]
[115,347000,350000,12340,9110,7090,5470,3850,2240,620,0,65800]
[]
[116,350000,353000,12590,9350,7210,5600,3970,2360,750,0,66700]
[117,353000,356000,12830,9600,7330,5720,4090,2480,870,0,67600]
[118,356000,359000,13080,9840,7450,5840,4220,2600,990,0,68500]
[119,359000,362000,13320,10090,7580,5960,4340,2730,1110,0,69400]
[120,362000,365000,13570,10330,7700,6090,4460,2850,1240,0,70400]
[]
[121,365000,368000,13810,10580,7820,6210,4580,2970,1360,0,71400]
[122,368000,371000,14060,10820,7940,6330,4710,3090,1480,0,72300]
[123,371000,374000,14300,11070,8070,6450,4830,3220,1600,0,73100]
[124,374000,377000,14550,11310,8190,6580,4950,3340,1730,100,73900]
[125,377000,380000,14790,11560,8320,6700,5070,3460,1850,220,74700]
[]
[126,380000,383000,15040,11800,8570,6820,5200,3580,1970,350,75700]
[127,383000,386000,15280,12050,8810,6940,5320,3710,2090,470,76500]
[128,386000,389000,15530,12290,9060,7070,5440,3830,2220,590,77300]
[129,389000,392000,15770,12540,9300,7190,5560,3950,2340,710,78200]
[130,392000,395000,16020,12780,9550,7310,5690,4070,2460,840,79700]
[]
[131,395000,398000,16260,13030,9790,7430,5810,4200,2580,960,81400]
[132,398000,401000,16510,13270,10040,7560,5930,4320,2710,1080,82900]
[133,401000,404000,16750,13520,10280,7680,6050,4440,2830,1200,84500]
[134,404000,407000,17000,13760,10530,7800,6180,4560,2950,1330,86100]
[135,407000,410000,17240,14010,10770,7920,6300,4690,3070,1450,87700]
[]
[136,410000,413000,17490,14250,11020,8050,6420,4810,3200,1570,89200]
[137,413000,416000,17730,14500,11260,8170,6540,4930,3320,1690,90800]
[138,416000,419000,17980,14740,11510,8290,6670,5050,3440,1820,92400]
[139,419000,422000,18220,14990,11750,8530,6790,5180,3560,1940,93900]
[140,422000,425000,18470,15230,12000,8770,6910,5300,3690,2060,95600]
[]
[141,425000,428000,18710,15480,12240,9020,7030,5420,3810,2180,97100]
[142,428000,431000,18960,15720,12490,9260,7160,5540,3930,2310,98600]
[143,431000,434000,19210,15970,12730,9510,7280,5670,4050,2430,100300]
[144,434000,437000,19450,16210,12980,9750,7400,5790,4180,2550,101800]
[145,437000,440000,19700,16460,13220,10000,7520,5910,4300,2680,103400]
[]
[146,440000,443000,20090,16700,13470,10240,7650,6030,4420,2800,105000]
[147,443000,446000,20580,16950,13710,10490,7770,6160,4540,2920,106600]
[148,446000,449000,21070,17190,13960,10730,7890,6280,4670,3040,108100]
[149,449000,452000,21560,17440,14200,10980,8010,6400,4790,3170,109700]
[150,452000,455000,22050,17680,14450,11220,8140,6520,4910,3290,111300]
[]
[151,455000,458000,22540,17930,14690,11470,8260,6650,5030,3410,112800]
[152,458000,461000,23030,18170,14940,11710,8470,6770,5160,3530,114500]
[153,461000,464000,23520,18420,15180,11960,8720,6890,5280,3660,116000]
[154,464000,467000,24010,18660,15430,12200,8960,7010,5400,3780,117500]
[155,467000,470000,24500,18910,15670,12450,9210,7140,5520,3900,119200]
[]
[156,470000,473000,24990,19150,15920,12690,9450,7260,5650,4020,120700]
[157,473000,476000,25480,19400,16160,12940,9700,7380,5770,4150,122300]
[158,476000,479000,25970,19640,16410,13180,9940,7500,5890,4270,123800]
[159,479000,482000,26460,20000,16650,13430,10190,7630,6010,4390,125400]
[160,482000,485000,26950,20490,16900,13670,10430,7750,6140,4510,127000]
{"$rows_left_out":244}
{"sheet":"明細書原本","index":1,"n_rows":28,"n_cols":11,"rows_kept":28,"cut":false,"hidden":false,"merged":[[29,3,29,6],[2,9,2,10],[17,3,17,4],[17,1,17,2],[13,9,17,9],[13,10,17,10],[5,2,5,3],[19,2,21,2],[23,2,25,2],[21,5,21,10],[25,5,25,10],[27,8,28,9],[27,10,28,10],[27,3,27,6],[28,3,28,6],[1,4,1,5],[1,2,1,3],[4,2,4,3],[2,2,2,3],[3,2,3,3]]}
[]
[null,null,"給与明細書"]
[null,null,null,null,null,null,null,null,null,"●●●●　株式会社"]
[]
[null,null,null,null,"様"]
[]
[]
[]
[]
[]
[]
[]
[null,null,null,null,null,null,null,null,null,"経理","社長"]
[]
[]
[]
[]
[null,"支給日"]
[]
[null,null,"支給額","基本給",null,"業務手当",null,"役職手当",null,"夜間作業手当"]
[null,null,null,"通勤手当",null,"資格手当",null,"その他"]
[null,null,null,"合計額"]
[]
[null,null,"控除額","厚生年金",null,"健康保険",null,"雇用保険",null,"社会保険料計"]
[null,null,null,"課税支給額",null,"所得税",null,"住民税",null,"携帯電話"]
[null,null,null,"合計額"]
[]
[null,null,"※備考",null,null,null,null,null,"差引支給額"]

{"sheet":"給与計算","index":2,"n_rows":39,"n_cols":24,"rows_kept":39,"cut":false,"hidden":false,"merged":[]}
[]
[null,"月分",{"$f":"C3","v":"2015-06-25"},"　←入力しない。"]
[null,"支給日","2015-06-25","　←入力する。　5/25　と入力する。"]
[]
[]
[]
[1,2,3,4,5,6,7,8,9,10,11,12,13,14,15,16,17,18,19,20,21]
[null,"社員名","基本給","業務手当","役職手当","夜間作業手当","通勤手当","資格手当","その他","総支給額","厚生年金","健康保険","雇用保険","社保計","社会保険控除後の金額","扶養数","源泉所得税","住民税","携帯電話超過分","控除計","差引支給額",null,"時給"]
[1,"山田太郎",null,null,null,null,null,null,null,{"$f":"SUM(C9:I9)","v":0},54169,69877,null,{"$f":"SUM(K9:M9)","v":124046},{"$f":"J9-N9","v":-124046},1,{"$f":"123520+ROUNDDOWN((O9-1010000)*0.321615,0)","v":-241206},78400,0,{"$f":"N9+Q9+R9+S9","v":-38760},{"$f":"O9-Q9-R9-S9","v":38760},null,{"$f":"ROUNDDOWN(J9/20/8,0)","v":0},{"$f":"B9","v":"山田太郎"}]
[2,"野口花子",null,null,null,null,null,null,null,{"$f":"SUM(C10:I10)","v":0},26211,14955,{"$f":"ROUNDDOWN(J10*6/1000,0)","v":0},{"$f":"SUM(K10:M10)","v":41166},{"$f":"J10-N10","v":-41166},0,{"$f":"VLOOKUP(O10,所得税!$B$10:$K$410,給与計算!P10+3,TRUE)","v":{"$error":"#N/A"}},19700,0,{"$f":"N10+Q10+R10+S10","v":{"$error":"#N/A"}},{"$error":"#N/A"},null,{"$f":"ROUNDDOWN(J10/20/8,0)","v":0},{"$f":"B10","v":"野口花子"}]
[3,"税務　清",null,null,null,null,null,null,null,{"$f":"SUM(C11:I11)","v":0},51548,34072,0,85620,-85620,1,{"$f":"VLOOKUP(O11,所得税!$B$10:$K$410,給与計算!P11+3,TRUE)","v":{"$error":"#N/A"}},38500,0,{"$f":"N11+Q11+R11+S11","v":{"$error":"#N/A"}},{"$error":"#N/A"},null,0,"税務　清"]
[4,"a",null,null,null,null,null,null,null,{"$f":"SUM(C12:I12)","v":0},38442,25410,0,63852,-63852,1,{"$f":"VLOOKUP(O12,所得税!$B$10:$K$410,給与計算!P12+3,TRUE)","v":{"$error":"#N/A"}},24000,0,{"$error":"#N/A"},{"$error":"#N/A"},null,0,"a"]
[5,"b",null,null,null,null,null,null,null,0,48927,32340,0,81267,-81267,1,{"$f":"VLOOKUP(O13,所得税!$B$10:$K$410,給与計算!P13+3,TRUE)","v":{"$error":"#N/A"}},29700,0,{"$error":"#N/A"},{"$error":"#N/A"},null,{"$f":"ROUNDDOWN(J13/20/8,0)","v":0},"b"]
[6,"c",null,null,null,null,null,null,null,0,27958,15952,0,43910,-43910,0,{"$f":"VLOOKUP(O14,所得税!$B$10:$K$410,給与計算!P14+3,TRUE)","v":{"$error":"#N/A"}},4800,0,{"$error":"#N/A"},{"$error":"#N/A"},null,0,"c"]
[7,"d",null,null,null,null,null,null,null,0,31453,17946,0,49399,-49399,3,{"$f":"VLOOKUP(O15,所得税!$B$10:$K$410,給与計算!P15+3,TRUE)","v":{"$error":"#N/A"}},1100,0,{"$error":"#N/A"},{"$error":"#N/A"},null,0,"d"]
[8,"e",null,null,null,null,null,null,null,0,22716,15015,{"$f":"ROUNDDOWN(J16*6/1000,0)","v":0},37731,-37731,3,{"$f":"VLOOKUP(O16,所得税!$B$10:$K$410,給与計算!P16+3,TRUE)","v":{"$error":"#N/A"}},2000,0,{"$error":"#N/A"},{"$error":"#N/A"},null,0,"e"]
[9,"f",null,null,null,null,null,null,null,0,29705,19635,0,49340,-49340,0,{"$f":"VLOOKUP(O17,所得税!$B$10:$K$410,給与計算!P17+3,TRUE)","v":{"$error":"#N/A"}},16900,0,{"$error":"#N/A"},{"$error":"#N/A"},null,0,"f"]
[10,"g",null,null,null,null,null,null,null,0,29705,16949,0,{"$f":"SUM(K18:M18)","v":46654},{"$f":"J18-N18","v":-46654},1,{"$f":"VLOOKUP(O18,所得税!$B$10:$K$410,給与計算!P18+3,TRUE)","v":{"$error":"#N/A"}},7900,0,{"$error":"#N/A"},{"$error":"#N/A"},null,0,"g"]
[11,"h",null,null,null,null,null,null,null,0,20968,11964,0,32932,-32932,0,{"$f":"VLOOKUP(O19,所得税!$B$10:$K$410,給与計算!P19+3,TRUE)","v":{"$error":"#N/A"}},5400,0,{"$error":"#N/A"},{"$f":"O19-Q19-R19-S19","v":{"$error":"#N/A"}},null,0,"h"]
[12,"i",null,null,null,null,null,null,null,0,24463,16170,0,40633,-40633,0,{"$f":"VLOOKUP(O20,所得税!$B$10:$K$410,給与計算!P20+3,TRUE)","v":{"$error":"#N/A"}},8100,0,{"$error":"#N/A"},{"$error":"#N/A"},null,0,"i"]
[13,"j",null,null,null,null,null,null,null,0,26211,17325,0,43536,{"$f":"J21-N21","v":-43536},0,{"$f":"VLOOKUP(O21,所得税!$B$10:$K$410,給与計算!P21+3,TRUE)","v":{"$error":"#N/A"}},0,0,{"$error":"#N/A"},{"$error":"#N/A"},null,0,"j"]
[14,"k",null,null,null,null,null,null,null,0,33200,21945,0,{"$f":"SUM(K22:M22)","v":55145},{"$f":"J22-N22","v":-55145},0,{"$f":"VLOOKUP(O22,所得税!$B$10:$K$410,給与計算!P22+3,TRUE)","v":{"$error":"#N/A"}},27000,0,{"$f":"N22+Q22+R22+S22","v":{"$error":"#N/A"}},{"$error":"#N/A"},null,0,"k"]
[15,";l",null,null,null,null,null,null,null,0,0,0,{"$f":"ROUNDDOWN(J23*6/1000,0)","v":0},{"$f":"SUM(K23:M23)","v":0},{"$f":"J23-N23","v":0},0,{"$f":"VLOOKUP(O23,所得税!$B$10:$K$410,給与計算!P23+3,TRUE)","v":{"$error":"#N/A"}},0,0,{"$error":"#N/A"},{"$error":"#N/A"},null,0,";l"]
[16,"m",null,null,null,null,null,null,null,0,null,null,{"$f":"ROUNDDOWN(J24*6/1000,0)","v":0},{"$f":"SUM(K24:M24)","v":0},{"$f":"J24-N24","v":0},null,{"$f":"VLOOKUP(O24,所得税!$B$10:$K$410,給与計算!P24+3,TRUE)","v":{"$error":"#N/A"}},null,null,{"$f":"N24+Q24+R24+S24","v":{"$error":"#N/A"}},{"$f":"O24-Q24-R24-S24","v":{"$error":"#N/A"}},null,0,"m"]
[17,"○○",null,null,null,null,null,null,null,0,null,null,0,0,0,null,{"$f":"VLOOKUP(O25,所得税!$B$10:$K$410,給与計算!P25+3,TRUE)","v":{"$error":"#N/A"}},null,null,{"$error":"#N/A"},{"$error":"#N/A"},null,0,"○○"]
[18,"○○○",null,null,null,null,null,null,null,0,null,null,0,0,0,null,{"$f":"VLOOKUP(O26,所得税!$B$10:$K$410,給与計算!P26+3,TRUE)","v":{"$error":"#N/A"}},null,null,{"$error":"#N/A"},{"$error":"#N/A"},null,0,"○○○"]
[19,"○○○○",null,null,null,null,null,null,null,0,null,null,0,0,0,null,{"$f":"VLOOKUP(O27,所得税!$B$10:$K$410,給与計算!P27+3,TRUE)","v":{"$error":"#N/A"}},null,null,{"$error":"#N/A"},{"$error":"#N/A"},null,0,"○○○○"]
[20,"○○○○○",null,null,null,null,null,null,null,0,null,null,0,0,0,null,{"$f":"VLOOKUP(O28,所得税!$B$10:$K$410,給与計算!P28+3,TRUE)","v":{"$error":"#N/A"}},null,null,{"$error":"#N/A"},{"$error":"#N/A"},null,0,"○○○○○"]
[null,null,null,null,null,null,null,null,null,{"$f":"SUM(J9:J23)","v":0},{"$f":"SUM(K9:K23)","v":465676},329555,0,{"$f":"SUM(N9:N23)","v":795231},-795231,null,{"$error":"#N/A"},263500,0,{"$error":"#N/A"},{"$error":"#N/A"},null,0]
[]
[]
[null,null,null,null,"＜手順＞"]
[null,null,null,null,"①前月のファイルをコピーし、ファイル名を変える。"]
[null,null,null,null,"②支給日を入力する。"]
[null,null,null,null,"③青色の部分を入力する。"]
[null,null,null,null,"④このシートを打ち出し、金額の確認をする。"]
[null,null,null,null,"⑤明細書作成ボタンをクリックすると、各人の明細が作成される。"]
[null,null,null,null,"⑥各人の明細書を打ち出す。"]
[null,null,null,null,"⑦打ち出した明細書の最終確認をする。"]